Target
Muscarinic acetylcholine receptor M2
Ligand
BDBM50296316
Substrate
Meas. Tech.
ChEMBL_581961 (CHEMBL1058941)
IC50
1.14±n/a nM
Citation
 Prat, MFernández, DBuil, MACrespo, MICasals, GFerrer, MTort, LCastro, JMonleón, JMGavaldà, AMiralpeix, MRamos, IDoménech, TVilella, DAntón, FHuerta, JMEspinosa, SLópez, MSentellas, SGonzález, MAlbertí, JSegarra, VCárdenas, ABeleta, JRyder, H Discovery of novel quaternary ammonium derivatives of (3R)-quinuclidinol esters as potent and long-acting muscarinic antagonists with potential for minimal systemic exposure after inhaled administration: identification of (3R)-3-{[hydroxy(di-2-thienyl)acetyl]oxy}-1-(3-phenoxypropyl)-1-azoniabicyclo J Med Chem 52:5076-92 (2010)  
Target
Name:
Muscarinic acetylcholine receptor M2
Synonyms:
ACM2_HUMAN Cholinergic, muscarinic M2 Muscarinic acetylcholine receptor M2 and M5 | RecName: Full=Muscarinic acetylcholine receptor M2
Type:
GPCR
Mol. Mass.:
51730.61
Organism:
Homo sapiens (Human)
Description:
P08172
Residue:
466
  
Inhibitor
Name:
BDBM50296316
Synonyms:
(3R)-1-Azabicyclo[2.2.2]oct-3-yl9-hydroxy-9H-fluorene-9-carboxylate | CHEMBL563887
Type:
Small organic molecule
Emp. Form.:
C21H21NO3
Mol. Mass.:
335.3963
SMILES:
OC1(C(=O)O[C@H]2CN3CCC2CC3)c2ccccc2-c2ccccc12
: