Target
Muscarinic acetylcholine receptor M3
Ligand
BDBM50296328
Substrate
Meas. Tech.
ChEMBL_581962 (CHEMBL1058942)
IC50
200±n/a nM
Citation
 Prat, MFernández, DBuil, MACrespo, MICasals, GFerrer, MTort, LCastro, JMonleón, JMGavaldà, AMiralpeix, MRamos, IDoménech, TVilella, DAntón, FHuerta, JMEspinosa, SLópez, MSentellas, SGonzález, MAlbertí, JSegarra, VCárdenas, ABeleta, JRyder, H Discovery of novel quaternary ammonium derivatives of (3R)-quinuclidinol esters as potent and long-acting muscarinic antagonists with potential for minimal systemic exposure after inhaled administration: identification of (3R)-3-{[hydroxy(di-2-thienyl)acetyl]oxy}-1-(3-phenoxypropyl)-1-azoniabicyclo J Med Chem 52:5076-92 (2010)  
Target
Name:
Muscarinic acetylcholine receptor M3
Synonyms:
ACM3_HUMAN Cholinergic, muscarinic M3 Muscarinic receptor M3 | RecName: Full=Muscarinic acetylcholine receptor M3
Type:
Enzyme
Mol. Mass.:
66151.03
Organism:
Homo sapiens (Human)
Description:
P20309
Residue:
590
  
Inhibitor
Name:
BDBM50296328
Synonyms:
(3R)-1-Benzyl-3-{[hydroxy(di-2-thienyl)acetyl]oxy}-1-azoniabicyclo[2.2.2]octane bromide | CHEMBL556634
Type:
Small organic molecule
Emp. Form.:
C24H26NO3S2
Mol. Mass.:
440.598
SMILES:
OC(C(=O)O[C@H]1C[N+]2(Cc3ccccc3)CCC1CC2)(c1cccs1)c1cccs1
: