Target
Muscarinic acetylcholine receptor M1
Ligand
BDBM50296315
Substrate
Meas. Tech.
ChEMBL_581960 (CHEMBL1058940)
IC50
15±n/a nM
Citation
 Prat, MFernández, DBuil, MACrespo, MICasals, GFerrer, MTort, LCastro, JMonleón, JMGavaldà, AMiralpeix, MRamos, IDoménech, TVilella, DAntón, FHuerta, JMEspinosa, SLópez, MSentellas, SGonzález, MAlbertí, JSegarra, VCárdenas, ABeleta, JRyder, H Discovery of novel quaternary ammonium derivatives of (3R)-quinuclidinol esters as potent and long-acting muscarinic antagonists with potential for minimal systemic exposure after inhaled administration: identification of (3R)-3-{[hydroxy(di-2-thienyl)acetyl]oxy}-1-(3-phenoxypropyl)-1-azoniabicyclo J Med Chem 52:5076-92 (2010)  
Target
Name:
Muscarinic acetylcholine receptor M1
Synonyms:
ACM1_HUMAN Cholinergic receptor, muscarinic 1 | Cholinergic, muscarinic M1
Type:
Protein
Mol. Mass.:
51442.54
Organism:
Homo sapiens (Human)
Description:
P11229
Residue:
460
  
Inhibitor
Name:
BDBM50296315
Synonyms:
(3R)-1-Azabicyclo[2.2.2]oct-3-yl 10,11-dihydro-5H-dibenzo-[a,d][7]annulene-5-carboxylate | CHEMBL551525
Type:
Small organic molecule
Emp. Form.:
C23H25NO2
Mol. Mass.:
347.4501
SMILES:
O=C(O[C@H]1CN2CCC1CC2)C1c2ccccc2CCc2ccccc12
: