Target
Angiotensin-converting enzyme
Ligand
BDBM50298106
Substrate
Meas. Tech.
ChEMBL_585129 (CHEMBL1060018)
IC50
830±n/a nM
Citation
 Olimpieri, FTambaro, SFustero, SLazzari, PSanchez-Roselló, MPani, LVolonterio, AZanda, M Synthesis and enzymatic evaluation of novel partially fluorinated thiol dual ACE/NEP inhibitors. Bioorg Med Chem Lett 19:4715-9 (2009)  
Target
Name:
Angiotensin-converting enzyme
Synonyms:
ACE Angiotensin converting enzyme (ACE) Angiotensin-converting enzyme, soluble form CD_antigen=CD143 DCP1 Kininase II
Type:
Enzyme
Mol. Mass.:
149709.01
Organism:
Homo sapiens (Human)
Description:
Residue:
1306
  
Inhibitor
Name:
BDBM50298106
Synonyms:
3-phenyl-2-(4,4,4-trifluoro-3-mercaptobutanamido)propanoic acid | CHEMBL560685
Type:
Small organic molecule
Emp. Form.:
C13H14F3NO3S
Mol. Mass.:
321.315
SMILES:
OC(=O)C(Cc1ccccc1)NC(=O)CC(S)C(F)(F)F
: