Target
Endothelin-converting enzyme 1
Ligand
BDBM50298108
Substrate
Meas. Tech.
ChEMBL_585131 (CHEMBL1060020)
IC50
>10000±n/a nM
Citation
 Olimpieri, FTambaro, SFustero, SLazzari, PSanchez-Roselló, MPani, LVolonterio, AZanda, M Synthesis and enzymatic evaluation of novel partially fluorinated thiol dual ACE/NEP inhibitors. Bioorg Med Chem Lett 19:4715-9 (2009)  
Target
Name:
Endothelin-converting enzyme 1
Synonyms:
ECE-1 ECE1_HUMAN Endothelin-converting enzyme 1 (ECE1)
Type:
Enzyme
Mol. Mass.:
87155.11
Organism:
Homo sapiens (Human)
Description:
P42892
Residue:
770
  
Inhibitor
Name:
BDBM50298108
Synonyms:
3-(4-Fluoro-phenyl)-2-(4,4,4-trifluoro-3-mercapto-butyrylamino)-propionic acid | CHEMBL551145
Type:
Small organic molecule
Emp. Form.:
C13H13F4NO3S
Mol. Mass.:
339.306
SMILES:
OC(=O)C(Cc1ccc(F)cc1)NC(=O)CC(S)C(F)(F)F
: