Target
Neprilysin [1-24]
Ligand
BDBM50298109
Substrate
Meas. Tech.
ChEMBL_585130 (CHEMBL1060019)
IC50
580±n/a nM
Citation
 Olimpieri, FTambaro, SFustero, SLazzari, PSanchez-Roselló, MPani, LVolonterio, AZanda, M Synthesis and enzymatic evaluation of novel partially fluorinated thiol dual ACE/NEP inhibitors. Bioorg Med Chem Lett 19:4715-9 (2009)  
Target
Name:
Neprilysin [1-24]
Synonyms:
MME Neprilysin
Type:
PROTEIN
Mol. Mass.:
2817.48
Organism:
Sus scrofa
Description:
ChEMBL_585130
Residue:
24
  
Inhibitor
Name:
BDBM50298109
Synonyms:
3-(1H-Indol-3-yl)-2-(4,4,4-trifluoro-3-mercapto-butyrylamino)-propionic acid | CHEMBL551622
Type:
Small organic molecule
Emp. Form.:
C15H15F3N2O3S
Mol. Mass.:
360.351
SMILES:
OC(=O)C(Cc1c[nH]c2ccccc12)NC(=O)CC(S)C(F)(F)F
: