Target
Endothelin-converting enzyme 1
Ligand
BDBM50046261
Substrate
Meas. Tech.
ChEMBL_585131 (CHEMBL1060020)
IC50
>10000±n/a nM
Citation
 Olimpieri, FTambaro, SFustero, SLazzari, PSanchez-Roselló, MPani, LVolonterio, AZanda, M Synthesis and enzymatic evaluation of novel partially fluorinated thiol dual ACE/NEP inhibitors. Bioorg Med Chem Lett 19:4715-9 (2009)  
Target
Name:
Endothelin-converting enzyme 1
Synonyms:
ECE-1 ECE1_HUMAN Endothelin-converting enzyme 1 (ECE1)
Type:
Enzyme
Mol. Mass.:
87155.11
Organism:
Homo sapiens (Human)
Description:
P42892
Residue:
770
  
Inhibitor
Name:
BDBM50046261
Synonyms:
2-(3-Mercapto-5-methyl-hexanoylamino)-3-phenyl-propionic acid CHEMBL173287
Type:
Small organic molecule
Emp. Form.:
C16H23NO3S
Mol. Mass.:
309.424
SMILES:
CC(C)CC(S)CC(=O)NC(Cc1ccccc1)C(O)=O
: