Target
cAMP-dependent protein kinase
Ligand
BDBM50366348
Substrate
Meas. Tech.
ChEMBL_586302 (CHEMBL1060164)
Ki
3000±n/a nM
Citation
 Engh, RAGirod, AKinzel, VHuber, RBossemeyer, D Crystal structures of catalytic subunit of cAMP-dependent protein kinase in complex with isoquinolinesulfonyl protein kinase inhibitors H7, H8, and H89. Structural implications for selectivity. J Biol Chem 271:26157-64 (1996)  
Target
Name:
cAMP-dependent protein kinase
Synonyms:
Cyclic AMP-dependent protein kinase (PKA) Serine/threonine-protein kinase | cAMP-dependent protein kinase alpha-catalytic subunit
Type:
Enzyme
Mol. Mass.:
40766.33
Organism:
Oryctolagus cuniculus (Rabbit)
Description:
Q95J97
Residue:
351
  
Inhibitor
Name:
BDBM50366348
Synonyms:
CHEMBL1233654
Type:
Small organic molecule
Emp. Form.:
C14H17N3O2S
Mol. Mass.:
291.369
SMILES:
C[C@H]1CNCCN1S(=O)(=O)c1cccc2cnccc12
: