Target
Myosin light chain kinase, smooth muscle
Ligand
BDBM15211
Substrate
Meas. Tech.
ChEMBL_587164 (CHEMBL1060228)
Ki
28300±n/a nM
Citation
 Engh, RAGirod, AKinzel, VHuber, RBossemeyer, D Crystal structures of catalytic subunit of cAMP-dependent protein kinase in complex with isoquinolinesulfonyl protein kinase inhibitors H7, H8, and H89. Structural implications for selectivity. J Biol Chem 271:26157-64 (1996)  
Target
Name:
Myosin light chain kinase, smooth muscle
Synonyms:
MLCK Mylk Telokin
Type:
Enzyme
Mol. Mass.:
210423.57
Organism:
Gallus gallus (chicken)
Description:
Residue:
1906
  
Inhibitor
Name:
BDBM15211
Synonyms:
CHEMBL104264 H89 N-(2-{[(2E)-3-(4-bromophenyl)prop-2-en-1-yl]amino}ethyl)isoquinoline-5-sulfonamide | N-[2-[[(E)-3-(4-bromophenyl)prop-2-enyl]amino]ethyl]isoquinoline-5-sulfonamide
Type:
Small organic molecule
Emp. Form.:
C20H20BrN3O2S
Mol. Mass.:
446.361
SMILES:
Brc1ccc(\C=C\CNCCNS(=O)(=O)c2cccc3cnccc23)cc1
: