Target
Maternal embryonic leucine zipper kinase
Ligand
BDBM13530
Substrate
Meas. Tech.
ChEMBL_586826 (CHEMBL1063803)
Kd
1900±n/a nM
Citation
 Karaman, MWHerrgard, STreiber, DKGallant, PAtteridge, CECampbell, BTChan, KWCiceri, PDavis, MIEdeen, PTFaraoni, RFloyd, MHunt, JPLockhart, DJMilanov, ZVMorrison, MJPallares, GPatel, HKPritchard, SWodicka, LMZarrinkar, PP A quantitative analysis of kinase inhibitor selectivity. Nat Biotechnol 26:127-32 (2008)  
Target
Name:
Maternal embryonic leucine zipper kinase
Synonyms:
KIAA0175 MELK_HUMAN Maternal embryonic leucine zipper kinase (MELK)
Type:
Enzyme
Mol. Mass.:
74665.45
Organism:
Homo sapiens (Human)
Description:
Q14680
Residue:
651
  
Inhibitor
Name:
BDBM13530
Synonyms:
4-[(4-methylpiperazin-1-yl)methyl]-N-[4-methyl-3-[(4-pyridin-3-ylpyrimidin-2-yl)amino]phenyl]benzamide Gleevec Imatinib, 21 STI-571 US10906896, Cpd imatinib US11725005, Compound imatinib cid_5291 med.21724, Compound 6
Type:
Small organic molecule
Emp. Form.:
C29H31N7O
Mol. Mass.:
493.6027
SMILES:
CN1CCN(Cc2ccc(cc2)C(=O)Nc2ccc(C)c(Nc3nccc(n3)-c3cccnc3)c2)CC1
: