Target
Cyclin-dependent kinase 7
Ligand
BDBM13216
Substrate
Meas. Tech.
ChEMBL_586444 (CHEMBL1063700)
Kd
>10000±n/a nM
Citation
 Karaman, MWHerrgard, STreiber, DKGallant, PAtteridge, CECampbell, BTChan, KWCiceri, PDavis, MIEdeen, PTFaraoni, RFloyd, MHunt, JPLockhart, DJMilanov, ZVMorrison, MJPallares, GPatel, HKPritchard, SWodicka, LMZarrinkar, PP A quantitative analysis of kinase inhibitor selectivity. Nat Biotechnol 26:127-32 (2008)  
Target
Name:
Cyclin-dependent kinase 7
Synonyms:
39 kDa protein kinase CAK1 CDK-activating kinase 1 (CAK) CDK7_HUMAN Cell division protein kinase 7 Cyclin-dependent kinase 7 (CDK7/cyclin H) P39 Mo15 TFIIH basal transcription factor complex kinase subunit
Type:
Enzyme Subunit
Mol. Mass.:
39047.01
Organism:
Homo sapiens (Human)
Description:
Residue:
346
  
Inhibitor
Name:
BDBM13216
Synonyms:
BMS-354825 DASATINIB N-(2-chloro-6-methylphenyl)-2-({6-[4-(2-hydroxyethyl)piperazin-1-yl]-2-methylpyrimidin-4-yl}amino)-1,3-thiazole-5-carboxamide US20230348453, Compound A8 med.21724, Compound Dasatinib
Type:
Small organic molecule
Emp. Form.:
C22H26ClN7O2S
Mol. Mass.:
488.006
SMILES:
Cc1nc(Nc2ncc(s2)C(=O)Nc2c(C)cccc2Cl)cc(n1)N1CCN(CCO)CC1
: