Target
Dual specificity mitogen-activated protein kinase kinase 2
Ligand
BDBM21
Substrate
Meas. Tech.
ChEMBL_586335 (CHEMBL1061079)
Kd
1100±n/a nM
Citation
 Karaman, MWHerrgard, STreiber, DKGallant, PAtteridge, CECampbell, BTChan, KWCiceri, PDavis, MIEdeen, PTFaraoni, RFloyd, MHunt, JPLockhart, DJMilanov, ZVMorrison, MJPallares, GPatel, HKPritchard, SWodicka, LMZarrinkar, PP A quantitative analysis of kinase inhibitor selectivity. Nat Biotechnol 26:127-32 (2008)  
Target
Name:
Dual specificity mitogen-activated protein kinase kinase 2
Synonyms:
Dual specificity mitogen-activated protein kinase kinase 2 (MEK2) ERK activator kinase 2 MAP2K2 MAPKK 2 MKK2 PRKMK2 | VHL-MAP2K1/MAP2K2
Type:
Enzyme Catalytic Domain
Mol. Mass.:
44423.61
Organism:
Homo sapiens (Human)
Description:
gi_13489054
Residue:
400
  
Inhibitor
Name:
BDBM21
Synonyms:
CHEMBL24828 VANDETANIB ZD6474 | cid_3081361
Type:
Emp. Form.:
C22H24BrFN4O2
Mol. Mass.:
475.354
SMILES:
COc1cc2c(Nc3ccc(Br)cc3F)ncnc2cc1OCC1CCN(C)CC1
: