Target
5-hydroxytryptamine receptor 3A
Ligand
BDBM50299667
Substrate
Meas. Tech.
ChEMBL_592418 (CHEMBL1037804)
Ki
30±n/a nM
Citation
 Butini, SBudriesi, RHamon, MMorelli, EGemma, SBrindisi, MBorrelli, GNovellino, EFiorini, IIoan, PChiarini, ACagnotto, AMennini, TFracasso, CCaccia, SCampiani, G Novel, potent, and selective quinoxaline-based 5-HT(3) receptor ligands. 1. Further structure-activity relationships and pharmacological characterization. J Med Chem 52:6946-50 (2009)  
Target
Name:
5-hydroxytryptamine receptor 3A
Synonyms:
5-HT3 5HT3A_RAT Htr3 Serotonin (5-HT) receptor | Zacopride site-R
Type:
Enzyme Catalytic Domain
Mol. Mass.:
55428.70
Organism:
RAT
Description:
5-HT3 HTR3A RAT::P35563
Residue:
483
  
Inhibitor
Name:
BDBM50299667
Synonyms:
7-fluoro-4-(4-((4,5-dihydro-1H-imidazol-2-yl)methyl)piperazin-1-yl)-pyrrolo[1,2-a]quinoxaline | CHEMBL576282
Type:
Small organic molecule
Emp. Form.:
C19H21FN6
Mol. Mass.:
352.4086
SMILES:
Fc1ccc2c(c1)nc(N1CCN(CC3=NCCN3)CC1)c1cccn21
: