Target
Carbonic anhydrase 7
Ligand
BDBM10887
Substrate
Meas. Tech.
ChEMBL_592890 (CHEMBL1046635)
Ki
0.9±n/a nM
Citation
 Temperini, CInnocenti, AScozzafava, AParkkila, SSupuran, CT The coumarin-binding site in carbonic anhydrase accommodates structurally diverse inhibitors: the antiepileptic lacosamide as an example and lead molecule for novel classes of carbonic anhydrase inhibitors. J Med Chem 53:850-4 (2010)  
Target
Name:
Carbonic anhydrase 7
Synonyms:
CA-VII CAH7_HUMAN Carbonic anhydrase Carbonic anhydrase VII (CA VII)
Type:
Enzyme
Mol. Mass.:
29664.11
Organism:
Homo sapiens (Human)
Description:
Human cloned isozyme.
Residue:
264
  
Inhibitor
Name:
BDBM10887
Synonyms:
Sulfamate 7 US11535599, Example topiramate | [(1R,2S,6S,9R)-4,4,11,11-tetramethyl-3,5,7,10,12-pentaoxatricyclo[7.3.0.0^{2,6}]dodecan-6-yl]methyl sulfamate
Type:
Small organic molecule
Emp. Form.:
C12H21NO8S
Mol. Mass.:
339.362
SMILES:
CC1(C)O[C@@H]2CO[C@@]3(COS(N)(=O)=O)OC(C)(C)O[C@H]3[C@@H]2O1
: