Target
Indoleamine 2,3-dioxygenase 1
Ligand
BDBM50300305
Substrate
Meas. Tech.
ChEMBL_590886 (CHEMBL1042996)
IC50
67±n/a nM
Citation
 Yue, EWDouty, BWayland, BBower, MLiu, XLeffet, LWang, QBowman, KJHansbury, MJLiu, CWei, MLi, YWynn, RBurn, TCKoblish, HKFridman, JSMetcalf, BScherle, PACombs, AP Discovery of potent competitive inhibitors of indoleamine 2,3-dioxygenase with in vivo pharmacodynamic activity and efficacy in a mouse melanoma model. J Med Chem 52:7364-7 (2009)  
Target
Name:
Indoleamine 2,3-dioxygenase 1
Synonyms:
I23O1_HUMAN IDO-1 INDO Indoleamine 2,3-dioxygenase | Indoleamine-pyrrole 2,3-dioxygenase
Type:
Enzyme
Mol. Mass.:
45330.80
Organism:
Homo sapiens (Human)
Description:
P14902
Residue:
403
  
Inhibitor
Name:
BDBM50300305
Synonyms:
4-Amino-N-(3-chloro-4-fluorophenyl)-N'-hydroxy-1,2,5-oxadiazole-3-carboximidamide US10669273, Compound INCB024360
Type:
Small organic molecule
Emp. Form.:
C9H7ClFN5O2
Mol. Mass.:
271.636
SMILES:
Nc1nonc1C(NO)=Nc1ccc(F)c(Cl)c1
: