Target
Carbonic anhydrase
Ligand
BDBM33276
Substrate
Meas. Tech.
ChEMBL_599732 (CHEMBL1048176)
Ki
7400±n/a nM
Citation
 Maresca, ACarta, FVullo, DScozzafava, ASupuran, CT Carbonic anhydrase inhibitors. Inhibition of the Rv1284 and Rv3273 beta-carbonic anhydrases from Mycobacterium tuberculosis with diazenylbenzenesulfonamides. Bioorg Med Chem Lett 19:4929-32 (2009)  
Target
Name:
Carbonic anhydrase
Synonyms:
PROBABLE TRANSMEMBRANE CARBONIC ANHYDRASE (CARBONATE DEHYDRATASE) (CARBONIC DEHYDRATASE)
Type:
PROTEIN
Mol. Mass.:
80567.22
Organism:
Mycobacterium tuberculosis
Description:
ChEMBL_878775
Residue:
764
  
Inhibitor
Name:
BDBM33276
Synonyms:
azo-sulfonamide, 2f
Type:
Small organic molecule
Emp. Form.:
C14H15N4O5S2
Mol. Mass.:
383.423
SMILES:
CN(CS([O-])(=O)=O)c1ccc(cc1)\N=N\c1cccc(c1)S(N)(=O)=O
: