Target
Carbonic anhydrase
Ligand
BDBM10861
Substrate
Meas. Tech.
ChEMBL_599732 (CHEMBL1048176)
Ki
3420±n/a nM
Citation
 Maresca, ACarta, FVullo, DScozzafava, ASupuran, CT Carbonic anhydrase inhibitors. Inhibition of the Rv1284 and Rv3273 beta-carbonic anhydrases from Mycobacterium tuberculosis with diazenylbenzenesulfonamides. Bioorg Med Chem Lett 19:4929-32 (2009)  
Target
Name:
Carbonic anhydrase
Synonyms:
PROBABLE TRANSMEMBRANE CARBONIC ANHYDRASE (CARBONATE DEHYDRATASE) (CARBONIC DEHYDRATASE)
Type:
PROTEIN
Mol. Mass.:
80567.22
Organism:
Mycobacterium tuberculosis
Description:
ChEMBL_878775
Residue:
764
  
Inhibitor
Name:
BDBM10861
Synonyms:
4-(2-aminoethyl)benzene-1-sulfonamide aromatic sulfonamide compound 7 | aromatic/heteroaromatic sulfonamide 6
Type:
Small organic molecule
Emp. Form.:
C8H12N2O2S
Mol. Mass.:
200.258
SMILES:
NCCc1ccc(cc1)S(N)(=O)=O
: