Target
Indoleamine 2,3-dioxygenase 1
Ligand
BDBM50303903
Substrate
Meas. Tech.
ChEMBL_595174 (CHEMBL1040016)
IC50
12500±n/a nM
Citation
 Röhrig, UFAwad, LGrosdidier, ALarrieu, PStroobant, VColau, DCerundolo, VSimpson, AJVogel, PVan den Eynde, BJZoete, VMichielin, O Rational design of indoleamine 2,3-dioxygenase inhibitors. J Med Chem 53:1172-89 (2010)  
Target
Name:
Indoleamine 2,3-dioxygenase 1
Synonyms:
I23O1_HUMAN IDO-1 INDO Indoleamine 2,3-dioxygenase | Indoleamine-pyrrole 2,3-dioxygenase
Type:
Enzyme
Mol. Mass.:
45330.80
Organism:
Homo sapiens (Human)
Description:
P14902
Residue:
403
  
Inhibitor
Name:
BDBM50303903
Synonyms:
4-(Isopropylamino)-1-naphthol | CHEMBL578212
Type:
Small organic molecule
Emp. Form.:
C13H15NO
Mol. Mass.:
201.2643
SMILES:
CC(C)Nc1ccc(O)c2ccccc12
: