Target
Tryptophan 2,3-dioxygenase
Ligand
BDBM50303904
Substrate
Meas. Tech.
ChEMBL_595175 (CHEMBL1040017)
IC50
>50000±n/a nM
Citation
 Röhrig, UFAwad, LGrosdidier, ALarrieu, PStroobant, VColau, DCerundolo, VSimpson, AJVogel, PVan den Eynde, BJZoete, VMichielin, O Rational design of indoleamine 2,3-dioxygenase inhibitors. J Med Chem 53:1172-89 (2010)  
Target
Name:
Tryptophan 2,3-dioxygenase
Synonyms:
T23O_MOUSE TRPO Tdo2 Tryptophan oxygenase Tryptophanase
Type:
PROTEIN
Mol. Mass.:
47757.90
Organism:
Mus musculus
Description:
ChEMBL_1452150
Residue:
406
  
Inhibitor
Name:
BDBM50303904
Synonyms:
(4E,4'E)-4,4'-bis(isopropylimino)-4',4'a-dihydro-2,2'-binaphthyl-1,1'(4H,8'aH)-dione | CHEMBL570794
Type:
Small organic molecule
Emp. Form.:
C26H26N2O2
Mol. Mass.:
398.4968
SMILES:
CC(C)Nc1cc(C2=CC(=NC(C)C)c3ccccc3C2=O)c(O)c2ccccc12
: