Target
Tryptophan 2,3-dioxygenase
Ligand
BDBM50241727
Substrate
Meas. Tech.
ChEMBL_595175 (CHEMBL1040017)
IC50
>400000±n/a nM
Citation
 Röhrig, UFAwad, LGrosdidier, ALarrieu, PStroobant, VColau, DCerundolo, VSimpson, AJVogel, PVan den Eynde, BJZoete, VMichielin, O Rational design of indoleamine 2,3-dioxygenase inhibitors. J Med Chem 53:1172-89 (2010)  
Target
Name:
Tryptophan 2,3-dioxygenase
Synonyms:
T23O_MOUSE TRPO Tdo2 Tryptophan oxygenase Tryptophanase
Type:
PROTEIN
Mol. Mass.:
47757.90
Organism:
Mus musculus
Description:
ChEMBL_1452150
Residue:
406
  
Inhibitor
Name:
BDBM50241727
Synonyms:
(S)-2-amino-3-(1-methyl-1H-indol-3-yl)propanoic acid 1-methyltryptophan L-1-methyl-tryptophan
Type:
Small organic molecule
Emp. Form.:
C12H14N2O2
Mol. Mass.:
218.2518
SMILES:
Cn1cc(C[C@H](N)C(O)=O)c2ccccc12
: