Target
Indoleamine 2,3-dioxygenase 1
Ligand
BDBM32142
Substrate
Meas. Tech.
ChEMBL_595171 (CHEMBL1040013)
IC50
3000±n/a nM
Citation
 Röhrig, UFAwad, LGrosdidier, ALarrieu, PStroobant, VColau, DCerundolo, VSimpson, AJVogel, PVan den Eynde, BJZoete, VMichielin, O Rational design of indoleamine 2,3-dioxygenase inhibitors. J Med Chem 53:1172-89 (2010)  
Target
Name:
Indoleamine 2,3-dioxygenase 1
Synonyms:
I23O1_HUMAN IDO-1 INDO Indoleamine 2,3-dioxygenase | Indoleamine-pyrrole 2,3-dioxygenase
Type:
Enzyme
Mol. Mass.:
45330.80
Organism:
Homo sapiens (Human)
Description:
P14902
Residue:
403
  
Inhibitor
Name:
BDBM32142
Synonyms:
5-amino-8-quinolinol 5-azanylquinolin-8-ol cid_416002
Type:
Small organic molecule
Emp. Form.:
C9H8N2O
Mol. Mass.:
160.1726
SMILES:
Nc1ccc(O)c2ncccc12
: