Target
Indoleamine 2,3-dioxygenase 1
Ligand
BDBM50303922
Substrate
Meas. Tech.
ChEMBL_595171 (CHEMBL1040013)
IC50
4500±n/a nM
Citation
 Röhrig, UFAwad, LGrosdidier, ALarrieu, PStroobant, VColau, DCerundolo, VSimpson, AJVogel, PVan den Eynde, BJZoete, VMichielin, O Rational design of indoleamine 2,3-dioxygenase inhibitors. J Med Chem 53:1172-89 (2010)  
Target
Name:
Indoleamine 2,3-dioxygenase 1
Synonyms:
I23O1_HUMAN IDO-1 INDO Indoleamine 2,3-dioxygenase | Indoleamine-pyrrole 2,3-dioxygenase
Type:
Enzyme
Mol. Mass.:
45330.80
Organism:
Homo sapiens (Human)
Description:
P14902
Residue:
403
  
Inhibitor
Name:
BDBM50303922
Synonyms:
4-(propylamino)naphthalen-1-ol | CHEMBL572064
Type:
Small organic molecule
Emp. Form.:
C13H15NO
Mol. Mass.:
201.2643
SMILES:
CCCNc1ccc(O)c2ccccc12
: