Target
Sodium-dependent noradrenaline transporter
Ligand
BDBM50304388
Substrate
Meas. Tech.
ChEMBL_602897 (CHEMBL1038440)
Ki
2402±n/a nM
Citation
 Cashman, JRGhirmai, S Inhibition of serotonin and norepinephrine reuptake and inhibition of phosphodiesterase by multi-target inhibitors as potential agents for depression. Bioorg Med Chem 17:6890-7 (2009)  
Target
Name:
Sodium-dependent noradrenaline transporter
Synonyms:
Monoamine transporter NET Noradrenaline Transporter (NET) Norepinephrine transporter protein (NET) SLC6A2 Sodium-dependent noradrenaline transporter (NET) | Solute carrier family 6 member 2
Type:
Multi-pass membrane protein
Mol. Mass.:
69337.72
Organism:
Homo sapiens (Human)
Description:
P23975
Residue:
617
  
Inhibitor
Name:
BDBM50304388
Synonyms:
(S)-3-(Naphthalen-1-yloxy)-3-thiophen-2-yl-propylamine | CHEMBL595063
Type:
Small organic molecule
Emp. Form.:
C17H17NOS
Mol. Mass.:
283.388
SMILES:
NCC[C@H](Oc1cccc2ccccc12)c1cccs1
: