Target
Vasopressin V2 receptor
Ligand
BDBM50177593
Substrate
Meas. Tech.
ChEMBL_609635 (CHEMBL1067198)
EC50
39.9±n/a nM
Citation
 Frantz, MCRodrigo, JBoudier, LDurroux, TMouillac, BHibert, M Subtlety of the structure-affinity and structure-efficacy relationships around a nonpeptide oxytocin receptor agonist. J Med Chem 53:1546-62 (2010)  
Target
Name:
Vasopressin V2 receptor
Synonyms:
ADHR AVPR2 DIR Renal-type arginine vasopressin receptor V2R_HUMAN Vasopressin V2 receptor | Vasopressin receptor
Type:
Receptor
Mol. Mass.:
40295.28
Organism:
Homo sapiens (Human)
Description:
P30518
Residue:
371
  
Inhibitor
Name:
BDBM50177593
Synonyms:
(5H,11H-benzo[e]pyrrolo[1,2-a][1,4]diazepin-10-yl)-[2-chloro-4-(3-methyl-pyrazol-1-yl)-phenyl]-methanone CHEMBL363910 WAY-VNA-932
Type:
Small organic molecule
Emp. Form.:
C23H19ClN4O
Mol. Mass.:
402.876
SMILES:
Cc1ccn(n1)-c1ccc(C(=O)N2Cc3cccn3Cc3ccccc23)c(Cl)c1
: