Target
Vasopressin V2 receptor
Ligand
BDBM50307118
Substrate
Meas. Tech.
ChEMBL_609622 (CHEMBL1065237)
Ki
29±n/a nM
Citation
 Frantz, MCRodrigo, JBoudier, LDurroux, TMouillac, BHibert, M Subtlety of the structure-affinity and structure-efficacy relationships around a nonpeptide oxytocin receptor agonist. J Med Chem 53:1546-62 (2010)  
Target
Name:
Vasopressin V2 receptor
Synonyms:
ADHR AVPR2 DIR Renal-type arginine vasopressin receptor V2R_HUMAN Vasopressin V2 receptor | Vasopressin receptor
Type:
Receptor
Mol. Mass.:
40295.28
Organism:
Homo sapiens (Human)
Description:
P30518
Residue:
371
  
Inhibitor
Name:
BDBM50307118
Synonyms:
5-[2-Chloro-4-(3-methyl-1H-pyrazol-1-yl)benzoyl]-1-methyl-1,4,5,10-tetrahydro pyrazolo[3,4-b][1,5]benzodiazepine | CHEMBL601931
Type:
Small organic molecule
Emp. Form.:
C22H19ClN6O
Mol. Mass.:
418.879
SMILES:
Cc1ccn(n1)-c1ccc(C(=O)N2Cc3cnn(C)c3Nc3ccccc23)c(Cl)c1
: