Target
Galanin receptor type 1
Ligand
BDBM50273358
Substrate
Meas. Tech.
ChEMBL_610349 (CHEMBL1072081)
Ki
387±n/a nM
Citation
 Robertson, CRScholl, EAPruess, THGreen, BRWhite, HSBulaj, G Engineering galanin analogues that discriminate between GalR1 and GalR2 receptor subtypes and exhibit anticonvulsant activity following systemic delivery. J Med Chem 53:1871-5 (2010)  
Target
Name:
Galanin receptor type 1
Synonyms:
GAL1-R GALNR1 GALR1_HUMAN Galanin receptor 1 | Galanin receptor type 1
Type:
Enzyme Catalytic Domain
Mol. Mass.:
38976.60
Organism:
Homo sapiens (Human)
Description:
Galanin R1 GALR1 HUMAN::P47211
Residue:
349
  
Inhibitor
Name:
BDBM50273358
Synonyms:
(S)-N-((S)-6-amino-1-((S)-6-amino-1-((S)-1-((S)-1,6-diamino-1-oxohexan-2-ylamino)-1-oxo-6-palmitamidohexan-2-ylamino)-1-oxohexan-2-ylamino)-1-oxohexan-2-yl)-1-(2-((S)-2-((S)-2-((S)-2-(2-((S)-2-((S)-2-((S)-4-amino-2-((S)-2-((2S,3R)-2-((S)-2-amino-3-(1H-indol-3-yl)propanamido)-3-hydroxybutanamido)-4-methylpentanamido)-4-oxobutanamido)-3-hydroxypropanamido)propanamido)acetamido)-3-(4-hydroxyphenyl)propanamido)-4-methylpentanamido)-4-methylpentanamido)acetyl)pyrrolidine-2-carboxamide Gal-B5
Type:
Small organic molecule
Emp. Form.:
C101H169N23O21
Mol. Mass.:
2041.5641
SMILES:
CCCCCCCCCCCCCCCC(=O)NCCCC[C@H](NC(=O)[C@H](CCCCN)NC(=O)[C@H](CCCCN)NC(=O)[C@@H]1CCCN1C(=O)CNC(=O)[C@H](CC(C)C)NC(=O)[C@H](CC(C)C)NC(=O)[C@H](Cc1ccc(O)cc1)NC(=O)CNC(=O)[C@H](C)NC(=O)[C@H](CO)NC(=O)[C@H](CC(N)=O)NC(=O)[C@H](CC(C)C)NC(=O)[C@@H](NC(=O)[C@@H](N)Cc1c[nH]c2ccccc12)[C@@H](C)O)C(=O)N[C@@H](CCCCN)C(N)=O
: