Target
Fibroblast growth factor 1
Ligand
BDBM50307398
Substrate
Meas. Tech.
ChEMBL_610685 (CHEMBL1072346)
Kd
160±n/a nM
Citation
 Johnstone, KDKaroli, TLiu, LDredge, KCopeman, ELi, CPDavis, KHammond, EBytheway, IKostewicz, EChiu, FCShackleford, DMCharman, SACharman, WNHarenberg, JGonda, TJFerro, V Synthesis and biological evaluation of polysulfated oligosaccharide glycosides as inhibitors of angiogenesis and tumor growth. J Med Chem 53:1686-99 (2010)  
Target
Name:
Fibroblast growth factor 1
Synonyms:
Acidic fibroblast growth factor ECGF-beta FGF1_HUMAN Fibroblast growth factor 1 (FGF-1) Heparin-binding growth factor 1 | aFGF
Type:
Protein
Mol. Mass.:
17461.01
Organism:
Homo sapiens (Human)
Description:
P05230
Residue:
155
  
Inhibitor
Name:
BDBM50307398
Synonyms:
CHEMBL603122 | Hexadecasodium [2-(benzyloxy)-3-({4-[(4-{[3,5-bis(sulfonatooxy)-6-[(sulfonatooxy)methyl]-4-{[3,4,5-tris(sulfonatooxy)-6-[(sulfonatooxy)methyl]oxan-2-yl]oxy}oxan-2-yl]oxy}-3,5-bis(sulfonatooxy)-6-[(sulfonatooxy)methyl]oxan-2-yl)oxy]-3,5-bis(sulfonatooxy)-6-[(sulfonatooxy)methyl]oxan-2-yl}oxy)-5-(sulfonatooxy)-6-[(sulfonatooxy)methyl]oxan-4-yl] sulfate
Type:
Small organic molecule
Emp. Form.:
C37H42O74S16
Mol. Mass.:
2183.734
SMILES:
[O-]S(=O)(=O)OC[C@H]1O[C@H](OCc2ccccc2)[C@@H](O[C@H]2O[C@H](COS([O-])(=O)=O)[C@@H](OS([O-])(=O)=O)[C@H](O[C@H]3O[C@H](COS([O-])(=O)=O)[C@@H](OS([O-])(=O)=O)[C@H](O[C@H]4O[C@H](COS([O-])(=O)=O)[C@@H](OS([O-])(=O)=O)[C@H](O[C@H]5O[C@H](COS([O-])(=O)=O)[C@@H](OS([O-])(=O)=O)[C@H](OS([O-])(=O)=O)[C@@H]5OS([O-])(=O)=O)[C@@H]4OS([O-])(=O)=O)[C@@H]3OS([O-])(=O)=O)[C@@H]2OS([O-])(=O)=O)[C@@H](OS([O-])(=O)=O)[C@@H]1OS([O-])(=O)=O
: