Target
P2Y purinoceptor 2
Ligand
BDBM50307836
Substrate
Meas. Tech.
ChEMBL_612643 (CHEMBL1065680)
IC50
10000±n/a nM
Citation
 Baqi, YLee, SYIqbal, JRipphausen, PLehr, AScheiff, ABZimmermann, HBajorath, JMüller, CE Development of potent and selective inhibitors of ecto-5'-nucleotidase based on an anthraquinone scaffold. J Med Chem 53:2076-86 (2010)  
Target
Name:
P2Y purinoceptor 2
Synonyms:
ATP receptor P2RY2 P2U purinoceptor 1 P2Y purinoceptor 2 Purinergic receptor | Purinergic receptor P2Y2
Type:
PROTEIN
Mol. Mass.:
42299.21
Organism:
Homo sapiens (Human)
Description:
ChEMBL_1455361
Residue:
377
  
Inhibitor
Name:
BDBM50307836
Synonyms:
CHEMBL608559 | Sodium 1-Amino-4-(2-anthracenylamino)-9,10-dioxo-9,10-dihydroanthracene-2-sulfonate
Type:
Small organic molecule
Emp. Form.:
C28H17N2O5S
Mol. Mass.:
493.511
SMILES:
Nc1c2C(=O)c3ccccc3C(=O)c2c(Nc2ccc3cc4ccccc4cc3c2)cc1S([O-])(=O)=O
: