Target
Adenosine receptor A2a
Ligand
BDBM50308507
Substrate
Meas. Tech.
ChEMBL_613345 (CHEMBL1074282)
Ki
501±n/a nM
Citation
 Scheiff, ABYerande, SGEl-Tayeb, ALi, WInamdar, GSVasu, KKSudarsanam, VMüller, CE 2-Amino-5-benzoyl-4-phenylthiazoles: Development of potent and selective adenosine A1 receptor antagonists. Bioorg Med Chem 18:2195-203 (2010)  
Target
Name:
Adenosine receptor A2a
Synonyms:
AA2AR_RAT Adenosine A2 receptor Adenosine Receptors A2a (A2a) Adenosine receptors A2a Rat striatal adenosine A2a receptor
Type:
G Protein-Coupled Receptor (GPCR)
Mol. Mass.:
45015.65
Organism:
Rattus norvegicus (rat)
Description:
Rat A2A receptors expressed in CHO cells.
Residue:
410
  
Inhibitor
Name:
BDBM50308507
Synonyms:
4-(2-phenyl-7H-pyrrolo[2,3-d]pyrimidin-4-ylamino)cyclohexanol SLV-320
Type:
Small organic molecule
Emp. Form.:
C18H20N4O
Mol. Mass.:
308.3776
SMILES:
OC1CCC(CC1)Nc1nc(nc2[nH]ccc12)-c1ccccc1
: