Target
Adenosine receptor A1
Ligand
BDBM50079654
Substrate
Meas. Tech.
ChEMBL_613344 (CHEMBL1074281)
Ki
12±n/a nM
Citation
 Scheiff, ABYerande, SGEl-Tayeb, ALi, WInamdar, GSVasu, KKSudarsanam, VMüller, CE 2-Amino-5-benzoyl-4-phenylthiazoles: Development of potent and selective adenosine A1 receptor antagonists. Bioorg Med Chem 18:2195-203 (2010)  
Target
Name:
Adenosine receptor A1
Synonyms:
A1 adenosine receptor (hA1) AA1R_HUMAN ADORA1 Adenosine A1-receptor Adenosine receptor A1 (hA1) | Adenosine transporter (AdT)
Type:
G Protein-Coupled Receptor (GPCR)
Mol. Mass.:
36520.92
Organism:
Homo sapiens (Human)
Description:
P30542
Residue:
326
  
Inhibitor
Name:
BDBM50079654
Synonyms:
4-(6-oxo-3-(2-phenylpyrazolo[1,5-a]pyridin-3-yl)pyridazin-1(6H)-yl)butanoic acid CHEMBL292917
Type:
Small organic molecule
Emp. Form.:
C21H18N4O3
Mol. Mass.:
374.3926
SMILES:
OC(=O)CCCn1nc(ccc1=O)-c1c(nn2ccccc12)-c1ccccc1
: