Target
Adenosine receptor A1
Ligand
BDBM50097431
Substrate
Meas. Tech.
ChEMBL_613353 (CHEMBL1074290)
Ki
76±n/a nM
Citation
 Scheiff, ABYerande, SGEl-Tayeb, ALi, WInamdar, GSVasu, KKSudarsanam, VMüller, CE 2-Amino-5-benzoyl-4-phenylthiazoles: Development of potent and selective adenosine A1 receptor antagonists. Bioorg Med Chem 18:2195-203 (2010)  
Target
Name:
Adenosine receptor A1
Synonyms:
AA1R_RAT ADENOSINE A1 high Adenosine A1 receptor (A1) Adenosine receptors A1 | Adora1
Type:
Protein
Mol. Mass.:
36704.13
Organism:
Rattus norvegicus (rat)
Description:
Residue:
326
  
Inhibitor
Name:
BDBM50097431
Synonyms:
4-Methoxy-N-(4-phenyl-thiazol-2-yl)-benzamide 4-methoxy-N-(4-phenylthiazol-2-yl)benzamide LUF-5433
Type:
Small organic molecule
Emp. Form.:
C17H14N2O2S
Mol. Mass.:
310.37
SMILES:
COc1ccc(cc1)C(=O)Nc1nc(cs1)-c1ccccc1
: