Target
Cytochrome P450 3A4
Ligand
BDBM50308874
Substrate
Meas. Tech.
ChEMBL_611723 (CHEMBL1074317)
IC50
21000±n/a nM
Citation
 Morwick, TBüttner, FHCywin, CLDahmann, GHickey, EJakes, SKaplita, PKashem, MAKerr, SKugler, SMao, WMarshall, DPaw, ZShih, CKWu, FYoung, E Hit to lead account of the discovery of bisbenzamide and related ureidobenzamide inhibitors of Rho kinase. J Med Chem 53:759-77 (2010)  
Target
Name:
Cytochrome P450 3A4
Synonyms:
Albendazole monooxygenase CP3A4_HUMAN CYP3A4 CYPIIIA4 Cytochrome P450 3A4 (CYP3A4) Nifedipine oxidase Taurochenodeoxycholate 6-alpha-hydroxylase
Type:
Enzyme
Mol. Mass.:
57349.57
Organism:
Homo sapiens (Human)
Description:
Residue:
503
  
Inhibitor
Name:
BDBM50308874
Synonyms:
3,4-Dimethoxy-N-[3-(2-pyridin-4-yl-ethylcarbamoyl)-benzyl]-benzamide | CHEMBL598336
Type:
Small organic molecule
Emp. Form.:
C24H25N3O4
Mol. Mass.:
419.473
SMILES:
COc1ccc(cc1OC)C(=O)NCc1cccc(c1)C(=O)NCCc1ccncc1
: