Target
Cytochrome P450 2C9
Ligand
BDBM50308874
Substrate
Meas. Tech.
ChEMBL_611718 (CHEMBL1074312)
IC50
16000±n/a nM
Citation
 Morwick, TBüttner, FHCywin, CLDahmann, GHickey, EJakes, SKaplita, PKashem, MAKerr, SKugler, SMao, WMarshall, DPaw, ZShih, CKWu, FYoung, E Hit to lead account of the discovery of bisbenzamide and related ureidobenzamide inhibitors of Rho kinase. J Med Chem 53:759-77 (2010)  
Target
Name:
Cytochrome P450 2C9
Synonyms:
(R)-limonene 6-monooxygenase CP2C9_HUMAN CYP2C9 Cytochrome P450 2C9 (CYP2C9 ) P-450MP P450 PB-1 | S-mephenytoin 4-hydroxylase
Type:
Enzyme
Mol. Mass.:
55636.33
Organism:
Homo sapiens (Human)
Description:
P11712
Residue:
490
  
Inhibitor
Name:
BDBM50308874
Synonyms:
3,4-Dimethoxy-N-[3-(2-pyridin-4-yl-ethylcarbamoyl)-benzyl]-benzamide | CHEMBL598336
Type:
Small organic molecule
Emp. Form.:
C24H25N3O4
Mol. Mass.:
419.473
SMILES:
COc1ccc(cc1OC)C(=O)NCc1cccc(c1)C(=O)NCCc1ccncc1
: