Target
Rho-associated protein kinase 2
Ligand
BDBM50308889
Substrate
Meas. Tech.
ChEMBL_607703 (CHEMBL1066168)
IC50
>7000000±n/a nM
Citation
 Morwick, TBüttner, FHCywin, CLDahmann, GHickey, EJakes, SKaplita, PKashem, MAKerr, SKugler, SMao, WMarshall, DPaw, ZShih, CKWu, FYoung, E Hit to lead account of the discovery of bisbenzamide and related ureidobenzamide inhibitors of Rho kinase. J Med Chem 53:759-77 (2010)  
Target
Name:
Rho-associated protein kinase 2
Synonyms:
KIAA0619 ROCK2 Rho kinase 2 (ROCKII) Rho-associated protein kinase 2 (ROCK2) Rho-associated protein kinase 2/Transforming protein RhoA Rho-associated, coiled-coil-containing protein kinase II p164 ROCK-2
Type:
Protein
Mol. Mass.:
160885.43
Organism:
Homo sapiens (Human)
Description:
O75116
Residue:
1388
  
Inhibitor
Name:
BDBM50308889
Synonyms:
4-Methoxy-N-[3-(2-pyridin-4-yl-ethylcarbamoyl)-benzyl]-benzamide | CHEMBL596708
Type:
Small organic molecule
Emp. Form.:
C23H23N3O3
Mol. Mass.:
389.447
SMILES:
COc1ccc(cc1)C(=O)NCc1cccc(c1)C(=O)NCCc1ccncc1
: