Target
Serine/threonine-protein kinase Chk1
Ligand
BDBM50309206
Substrate
Meas. Tech.
ChEMBL_608809 (CHEMBL1068401)
IC50
1100±n/a nM
Citation
 Hilton, SNaud, SCaldwell, JJBoxall, KBurns, SAnderson, VEAntoni, LAllen, CEPearl, LHOliver, AWWynne Aherne, GGarrett, MDCollins, I Identification and characterisation of 2-aminopyridine inhibitors of checkpoint kinase 2. Bioorg Med Chem 18:707-18 (2010)  
Target
Name:
Serine/threonine-protein kinase Chk1
Synonyms:
CHEK1 CHK1 checkpoint homolog Checkpoint kinase-1 (CHK1)
Type:
Enzyme Catalytic Domain
Mol. Mass.:
54443.02
Organism:
Homo sapiens (Human)
Description:
gi_166295192
Residue:
476
  
Inhibitor
Name:
BDBM50309206
Synonyms:
4-(2-Amino-5-(4-hydroxy-3-methoxyphenyl)pyridin-3-yl)benzamide CHEMBL600441
Type:
Small organic molecule
Emp. Form.:
C19H17N3O3
Mol. Mass.:
335.3566
SMILES:
COc1cc(ccc1O)-c1cnc(N)c(c1)-c1ccc(cc1)C(N)=O
: