Target
Sortase family protein
Ligand
BDBM50312643
Substrate
Meas. Tech.
ChEMBL_616480 (CHEMBL1101672)
IC50
129700±n/a nM
Citation
 Jeon, JENa, ZJung, MLee, HSSim, CJNahm, KOh, KBShin, J Discorhabdins from the Korean marine sponge Sceptrella sp. J Nat Prod 73:258-62 (2010)  
Target
Name:
Sortase family protein
Synonyms:
Sortase | Sortase A (SrtA)
Type:
Enzyme
Mol. Mass.:
23546.15
Organism:
Staphylococcus aureus
Description:
Residue:
206
  
Inhibitor
Name:
BDBM50312643
Synonyms:
(-)-Discorhabdin L | CHEMBL1088180
Type:
Small organic molecule
Emp. Form.:
C18H14N3O3S
Mol. Mass.:
352.387
SMILES:
O[C@H]1C2=[N+]3CCc4c[nH]c5c(O)c6N[C@@H]7C[C@@]1(C(S7)=CC2=O)c6c3c45
: