Target
Receptor-type tyrosine-protein kinase FLT3
Ligand
BDBM50185084
Substrate
Meas. Tech.
ChEMBL_627418 (CHEMBL1115348)
IC50
2900±n/a nM
Citation
 Gangjee, AZaware, NRaghavan, SIhnat, MShenoy, SKisliuk, RL Single agents with designed combination chemotherapy potential: synthesis and evaluation of substituted pyrimido[4,5-b]indoles as receptor tyrosine kinase and thymidylate synthase inhibitors and as antitumor agents. J Med Chem 53:1563-78 (2010)  
Target
Name:
Receptor-type tyrosine-protein kinase FLT3
Synonyms:
CD135 FL cytokine receptor FLK2 FLT3 Fetal liver kinase-2 Fms-like tyrosine kinase 3 (Flt-3) STK-1 Stem cell tyrosine kinase 1
Type:
Enzyme
Mol. Mass.:
112888.62
Organism:
Homo sapiens (Human)
Description:
P36888
Residue:
993
  
Inhibitor
Name:
BDBM50185084
Synonyms:
2-(3,4-dimethoxybenzamido)-4,5,6,7-tetrahydrobenzo[b]thiophene-3-carboxamide CHEMBL210833
Type:
Small organic molecule
Emp. Form.:
C18H20N2O4S
Mol. Mass.:
360.427
SMILES:
COc1ccc(cc1OC)C(=O)Nc1sc2CCCCc2c1C(N)=O
: