Target
Potassium voltage-gated channel subfamily H member 2
Ligand
BDBM50297309
Substrate
Meas. Tech.
ChEMBL_624296 (CHEMBL1106981)
Ki
>5±n/a nM
Citation
 Moree, WJJovic, FCoon, TYu, JLi, BFTucci, FCMarinkovic, DGross, RSMalany, SBradbury, MJHernandez, LMO'Brien, ZWen, JWang, HHoare, SRPetroski, RESacaan, AMadan, ACrowe, PDBeaton, G Novel benzothiophene H1-antihistamines for the treatment of insomnia. Bioorg Med Chem Lett 20:2316-20 (2010)  
Target
Name:
Potassium voltage-gated channel subfamily H member 2
Synonyms:
1,3-beta-glucan synthase component GLS2 ERG Eag-related protein 1 Ether-a-go-go-related gene (HERG) Ether-a-go-go-related gene potassium channel 1 Ether-a-go-go-related gene potassium channel 1 (hERG1) Ether-a-go-go-related protein 1 H-ERG KCNH2 Potassium voltage-gated channel subfamily H member 2 (hERG) Voltage-gated potassium channel subunit Kv11.1 hERG Potassium Channel 1 | putative potassium channel subunit
Type:
Multi-pass membrane protein
Mol. Mass.:
126672.65
Organism:
Homo sapiens (Human)
Description:
Q12809
Residue:
1159
  
Inhibitor
Name:
BDBM50297309
Synonyms:
(-)-(R)-N,N-dimethyl-2-(3-(1-(pyridin-2-yl)ethyl)benzo[b]thiophen-2-yl)ethanamine CHEMBL564144
Type:
Small organic molecule
Emp. Form.:
C19H22N2S
Mol. Mass.:
310.456
SMILES:
C[C@H](c1c(CCN(C)C)sc2ccccc12)c1ccccn1
: