Target
Adenosine receptor A1
Ligand
BDBM50048466
Substrate
Meas. Tech.
ChEMBL_627305 (CHEMBL1105451)
Ki
594.1±n/a nM
Citation
 Mishra, CBBarodia, SKPrakash, ASenthil Kumar, JBLuthra, PM Novel 8-(furan-2-yl)-3-substituted thiazolo [5,4-e][1,2,4] triazolo[1,5-c] pyrimidine-2(3H)-thione derivatives as potential adenosine A(2A) receptor antagonists. Bioorg Med Chem 18:2491-500 (2010)  
Target
Name:
Adenosine receptor A1
Synonyms:
A1 adenosine receptor (hA1) AA1R_HUMAN ADORA1 Adenosine A1-receptor Adenosine receptor A1 (hA1) | Adenosine transporter (AdT)
Type:
G Protein-Coupled Receptor (GPCR)
Mol. Mass.:
36520.92
Organism:
Homo sapiens (Human)
Description:
P30542
Residue:
326
  
Inhibitor
Name:
BDBM50048466
Synonyms:
2-(furan-2-yl)-7-phenethyl-7H-pyrazolo[4,3-e][1,2,4]triazolo[1,5-c]pyrimidin-5-amine 2-Furan-2-yl-7-phenethyl-7H-pyrazolo[4,3-e][1,2,4]triazolo[1,5-c]pyrimidin-5-ylamine(SCH 58261) SCH-58261 US11440916, HZ10126
Type:
Small organic molecule
Emp. Form.:
C18H15N7O
Mol. Mass.:
345.358
SMILES:
Nc1nc2n(CCc3ccccc3)ncc2c2nc(nn12)-c1ccco1
: