Target
Glucocorticoid receptor
Ligand
BDBM50315763
Substrate
Meas. Tech.
ChEMBL_624272 (CHEMBL1106116)
Ki
2±n/a nM
Citation
 Onnis, VKinsella, GKCarta, GJagoe, WNPrice, TWilliams, DCFayne, DLloyd, DG Virtual screening for the identification of novel nonsteroidal glucocorticoid modulators. J Med Chem 53:3065-74 (2010)  
Target
Name:
Glucocorticoid receptor
Synonyms:
GCR_HUMAN GRL Glucocorticoid receptor (GRFP) Nuclear receptor subfamily 3 group C member 1
Type:
Enzyme
Mol. Mass.:
85656.87
Organism:
Homo sapiens (Human)
Description:
P04150
Residue:
777
  
Inhibitor
Name:
BDBM50315763
Synonyms:
(4bS,7R,8aR)-4b-benzyl-7-hydroxy-7-(prop-1-ynyl)-N-(pyridin-4-ylmethyl)-4b,5,6,7,8,8a,9,10-octahydrophenanthrene-2-carboxamide | CHEMBL1090477
Type:
Small organic molecule
Emp. Form.:
C31H32N2O2
Mol. Mass.:
464.598
SMILES:
CC#C[C@@]1(O)CC[C@]2(Cc3ccccc3)[C@H](CCc3cc(ccc23)C(=O)NCc2ccncc2)C1
: