Target
Glucocorticoid receptor
Ligand
BDBM50315768
Substrate
Meas. Tech.
ChEMBL_624272 (CHEMBL1106116)
Ki
4109±n/a nM
Citation
 Onnis, VKinsella, GKCarta, GJagoe, WNPrice, TWilliams, DCFayne, DLloyd, DG Virtual screening for the identification of novel nonsteroidal glucocorticoid modulators. J Med Chem 53:3065-74 (2010)  
Target
Name:
Glucocorticoid receptor
Synonyms:
GCR_HUMAN GRL Glucocorticoid receptor (GRFP) Nuclear receptor subfamily 3 group C member 1
Type:
Enzyme
Mol. Mass.:
85656.87
Organism:
Homo sapiens (Human)
Description:
P04150
Residue:
777
  
Inhibitor
Name:
BDBM50315768
Synonyms:
5-bromo-4-methoxy-2-(((1S)-2,2,5-trimethyl-6-methylenecyclohexyl)methyl)phenyl acetate | CHEMBL1093140
Type:
Small organic molecule
Emp. Form.:
C20H27BrO3
Mol. Mass.:
395.331
SMILES:
COc1cc(C[C@@H]2C(=C)C(C)CCC2(C)C)c(OC(C)=O)cc1Br
: