Target
Histone deacetylase 6
Ligand
BDBM50317968
Substrate
Meas. Tech.
ChEMBL_630914 (CHEMBL1113906)
IC50
40±n/a nM
Citation
 Bressi, JCde Jong, RWu, YJennings, AJBrown, JWO'Connell, STari, LWSkene, RJVu, PNavre, MCao, XGangloff, AR Benzimidazole and imidazole inhibitors of histone deacetylases: Synthesis and biological activity. Bioorg Med Chem Lett 20:3138-41 (2010)  
Target
Name:
Histone deacetylase 6
Synonyms:
Cereblon/Histone deacetylase 6 HDAC6 Histone deacetylase 6 (HDAC6) KIAA0901 | ORF Names:JM21
Type:
Chromatin regulator; hydrolase; repressor
Mol. Mass.:
131381.51
Organism:
Homo sapiens (Human)
Description:
Q9UBN7
Residue:
1215
  
Inhibitor
Name:
BDBM50317968
Synonyms:
(R)-N-hydroxy-3-(3-(1-(1-phenylethyl)-1H-benzo[d]imidazol-2-yl)phenyl)acrylamide | CHEMBL1094792
Type:
Small organic molecule
Emp. Form.:
C24H21N3O2
Mol. Mass.:
383.4424
SMILES:
C[C@H](c1ccccc1)n1c(nc2ccccc12)-c1cccc(\C=C\C(=O)NO)c1
: