Target
Adenosine receptor A2b
Ligand
BDBM50318268
Substrate
Meas. Tech.
ChEMBL_629514 (CHEMBL1120803)
IC50
49.8±n/a nM
Citation
 Taliani, SLa Motta, CMugnaini, LSimorini, FSalerno, SMarini, AMDa Settimo, FCosconati, SCosimelli, BGreco, GLimongelli, VMarinelli, LNovellino, ECiampi, ODaniele, STrincavelli, MLMartini, C Novel N2-substituted pyrazolo[3,4-d]pyrimidine adenosine A3 receptor antagonists: inhibition of A3-mediated human glioblastoma cell proliferation. J Med Chem 53:3954-63 (2010)  
Target
Name:
Adenosine receptor A2b
Synonyms:
AA2BR_HUMAN ADORA2B Adenosine receptors A2b | Adenosine receptors; A2a & A2b
Type:
G Protein-Coupled Receptor (GPCR)
Mol. Mass.:
36341.22
Organism:
Homo sapiens (Human)
Description:
Residue:
332
  
Inhibitor
Name:
BDBM50318268
Synonyms:
CHEMBL1096754 | N-(2-methyl-6-phenyl-2H-pyrazolo[3,4-d]pyrimidin-4-yl)benzamide
Type:
Small organic molecule
Emp. Form.:
C19H15N5O
Mol. Mass.:
329.3553
SMILES:
Cn1cc2c(NC(=O)c3ccccc3)nc(nc2n1)-c1ccccc1
: