Target
Aromatase
Ligand
BDBM31772
Substrate
Meas. Tech.
ChEMBL_630232 (CHEMBL1105634)
IC50
600±n/a nM
Citation
 Muftuoglu, YMustata, G Pharmacophore modeling strategies for the development of novel nonsteroidal inhibitors of human aromatase (CYP19). Bioorg Med Chem Lett 20:3050-64 (2010)  
Target
Name:
Aromatase
Synonyms:
ARO1 CP19A_HUMAN CYP19 CYPXIX Cytochrome P450 19A1 Cytochrome P450-C19 (CYP19) FL cytokine receptor precursor | P-450AROM
Type:
Enzyme
Mol. Mass.:
57888.92
Organism:
Homo sapiens (Human)
Description:
P11511
Residue:
503
  
Inhibitor
Name:
BDBM31772
Synonyms:
1-[2-(2,4-dichlorobenzyl)oxy-2-(2,4-dichlorophenyl)ethyl]imidazole;nitric acid CHEMBL91 Miconazole US9144538, Miconazole Nitrate | cid_4189
Type:
Small organic molecule
Emp. Form.:
C18H14Cl4N2O
Mol. Mass.:
416.129
SMILES:
Clc1ccc(COC(Cn2ccnc2)c2ccc(Cl)cc2Cl)c(Cl)c1
: