Target
C-C chemokine receptor type 5
Ligand
BDBM50115528
Substrate
Meas. Tech.
ChEMBL_630265 (CHEMBL1106474)
IC50
6±n/a nM
Citation
 Rotstein, DMMelville, CRPadilla, FCournoyer, DLee, EKLemoine, RPetersen, ACSetti, LQWanner, JChen, LFilonova, LLoughhead, DGManka, JLin, XFGleason, SSankuratri, SJi, CDerosier, ADioszegi, MHeilek, GJekle, ABerry, PMau, CIWeller, P Novel hexahydropyrrolo[3,4-c]pyrrole CCR5 antagonists. Bioorg Med Chem Lett 20:3116-9 (2010)  
Target
Name:
C-C chemokine receptor type 5
Synonyms:
C-C CKR-5 CC-CKR-5 CCR5 CCR5_HUMAN CHEMR13 HIV-1 fusion coreceptor
Type:
Enzyme
Mol. Mass.:
40540.21
Organism:
Homo sapiens (Human)
Description:
P51681
Residue:
352
  
Inhibitor
Name:
BDBM50115528
Synonyms:
(Z)-(4-((4-bromophenyl)(ethoxyimino)methyl)-4'-methyl-1,4'-bipiperidin-1'-yl)(2,6-dimethylphenyl)methanone {4-[(4-Bromo-phenyl)-ethoxyimino-methyl]-4'-methyl-[1,4']bipiperidinyl-1'-yl}-(2,6-dimethyl-phenyl)-methanone
Type:
Small organic molecule
Emp. Form.:
C29H38BrN3O2
Mol. Mass.:
540.535
SMILES:
CCO\N=C(\C1CCN(CC1)C1(C)CCN(CC1)C(=O)c1c(C)cccc1C)c1ccc(Br)cc1
: