Target
Transient receptor potential cation channel subfamily A member 1
Ligand
BDBM36263
Substrate
Meas. Tech.
ChEMBL_633028 (CHEMBL1118253)
IC50
660000±n/a nM
Citation
 Baraldi, PGPreti, DMaterazzi, SGeppetti, P Transient receptor potential ankyrin 1 (TRPA1) channel as emerging target for novel analgesics and anti-inflammatory agents. J Med Chem 53:5085-107 (2010)  
Target
Name:
Transient receptor potential cation channel subfamily A member 1
Synonyms:
ANKTM1 TRPA1 Transformation-sensitive protein p120 | Transient receptor potential cation channel subfamily A member 1 (TRPA1)
Type:
Protein
Mol. Mass.:
127514.20
Organism:
Homo sapiens (Human)
Description:
O75762
Residue:
1119
  
Inhibitor
Name:
BDBM36263
Synonyms:
(+)-camphor
Type:
Guest
Emp. Form.:
C10H16O
Mol. Mass.:
152.2334
SMILES:
CC1(C)[C@@H]2CC[C@@]1(C)C(=O)C2
: