Target
Transient receptor potential cation channel subfamily A member 1
Ligand
BDBM50240948
Substrate
Meas. Tech.
ChEMBL_633010 (CHEMBL1118235)
EC50
1320±n/a nM
Citation
 Baraldi, PGPreti, DMaterazzi, SGeppetti, P Transient receptor potential ankyrin 1 (TRPA1) channel as emerging target for novel analgesics and anti-inflammatory agents. J Med Chem 53:5085-107 (2010)  
Target
Name:
Transient receptor potential cation channel subfamily A member 1
Synonyms:
Anktm1 Trpa1
Type:
PROTEIN
Mol. Mass.:
128485.09
Organism:
Mus musculus
Description:
ChEMBL_1367709
Residue:
1125
  
Inhibitor
Name:
BDBM50240948
Synonyms:
CHEMBL359965 allicin | thio-2-propene-1-sulfinic acid S-allyl ester
Type:
Small organic molecule
Emp. Form.:
C6H10OS2
Mol. Mass.:
162.273
SMILES:
C=CCSS(=O)CC=C
: