Target
Transient receptor potential cation channel subfamily V member 1
Ligand
BDBM50240948
Substrate
Meas. Tech.
ChEMBL_633012 (CHEMBL1118237)
EC50
51220±n/a nM
Citation
 Baraldi, PGPreti, DMaterazzi, SGeppetti, P Transient receptor potential ankyrin 1 (TRPA1) channel as emerging target for novel analgesics and anti-inflammatory agents. J Med Chem 53:5085-107 (2010)  
Target
Name:
Transient receptor potential cation channel subfamily V member 1
Synonyms:
Capsaicin receptor TRPV1_RAT Trpv1 Vanilloid VR1 Vanilloid receptor 1 (VRI/TRPV1) Vanilloid receptor type 1-like (TrpV1/Vr1) Vr1l | osm-9-like TRP channel 1
Type:
Transient Receptor
Mol. Mass.:
94956.12
Organism:
Rattus norvegicus (rat)
Description:
O35433
Residue:
838
  
Inhibitor
Name:
BDBM50240948
Synonyms:
CHEMBL359965 allicin | thio-2-propene-1-sulfinic acid S-allyl ester
Type:
Small organic molecule
Emp. Form.:
C6H10OS2
Mol. Mass.:
162.273
SMILES:
C=CCSS(=O)CC=C
: