Target
Orexin receptor type 2
Ligand
BDBM50318695
Substrate
Meas. Tech.
ChEMBL_633510 (CHEMBL1119824)
Ki
0.36±n/a nM
Citation
 Cox, CDBreslin, MJWhitman, DBSchreier, JDMcGaughey, GBBogusky, MJRoecker, AJMercer, SPBednar, RALemaire, WBruno, JGReiss, DRHarrell, CMMurphy, KLGarson, SLDoran, SMPrueksaritanont, TAnderson, WBTang, CRoller, SCabalu, TDCui, DHartman, GDYoung, SDKoblan, KSWinrow, CJRenger, JJColeman, PJ Discovery of the dual orexin receptor antagonist [(7R)-4-(5-chloro-1,3-benzoxazol-2-yl)-7-methyl-1,4-diazepan-1-yl][5-methyl-2-(2H-1,2,3-triazol-2-yl)phenyl]methanone (MK-4305) for the treatment of insomnia. J Med Chem 53:5320-32 (2010)  
Target
Name:
Orexin receptor type 2
Synonyms:
HCRTR2 OX2R_HUMAN Orexin receptor type 2 (OR-2) Orexin receptor type 2 (OX2R) Ox-2-R | Ox2-R
Type:
Protein
Mol. Mass.:
50710.53
Organism:
Homo sapiens (Human)
Description:
O43614
Residue:
444
  
Inhibitor
Name:
BDBM50318695
Synonyms:
2-{(5R)-5-Methyl-4-[5-methyl-2-(2H-1,2,3-triazol-2-yl)benzoyl]-1,4-diazepan-1-yl}quinazoline | CHEMBL1083357
Type:
Small organic molecule
Emp. Form.:
C24H25N7O
Mol. Mass.:
427.5016
SMILES:
C[C@@H]1CCN(CCN1C(=O)c1cc(C)ccc1-n1nccn1)c1ncc2ccccc2n1
: