Target
Prostaglandin G/H synthase 1
Ligand
BDBM50110484
Substrate
Meas. Tech.
ChEMBL_638977 (CHEMBL1168960)
IC50
>10000±n/a nM
Citation
 Bridoux, AMillet, RPommery, JPommery, NHenichart, JP Synthesis and biological activity of N-aroyl-tetrahydro-gamma-carbolines. Bioorg Med Chem 18:3910-24 (2010)  
Target
Name:
Prostaglandin G/H synthase 1
Synonyms:
COX-1 Cyclooxygenase Cyclooxygenase-1 (COX-1) PTGS1 | Prostaglandin G/H synthase (cyclooxygenase)
Type:
Enzyme
Mol. Mass.:
68692.62
Organism:
Homo sapiens (Human)
Description:
P23219
Residue:
599
  
Inhibitor
Name:
BDBM50110484
Synonyms:
3-((3-fluoro-5-(1-methoxycyclohexyl)phenoxy)methyl)-1-(4-(methylsulfonyl)phenyl)-5-phenyl-1H-pyrazole 3-[3-Fluoro-5-(4-methoxy-tetrahydro-pyran-4-yl)-phenoxymethyl]-1-(4-methanesulfonyl-phenyl)-5-phenyl-1H-pyrazole CHEMBL423638
Type:
Small organic molecule
Emp. Form.:
C29H29FN2O5S
Mol. Mass.:
536.614
SMILES:
COC1(CCOCC1)c1cc(F)cc(OCc2cc(-c3ccccc3)n(n2)-c2ccc(cc2)S(C)(=O)=O)c1
: